{"text_format":"1","workbook":"xlsx","n_sheets":5,"sheets":["CONSIGNES","CALCUL - Exemple","CALCUL - mensuel","Calcul infra-mensuel","REFERENTIEL"],"not_rendered":{"charts":0,"images":2,"macros":1,"external_links":0,"defined_names":2,"comments":0,"pivot_tables":0},"unopened":[],"bounds":{"document_bytes":16777216,"sheet_cells":100000,"rows_first":2000,"rows_last":500,"rows_between":2000,"halvings":0,"cell_chars":16384,"cell_head_chars":4096},"cells_cut":0,"cells_raw":0,"read":"whole","date_system":"1900"}

{"sheet":"CONSIGNES","index":0,"n_rows":0,"n_cols":0,"rows_kept":0,"cut":false,"hidden":false,"merged":[]}

{"sheet":"CALCUL - Exemple","index":1,"n_rows":45,"n_cols":10,"rows_kept":45,"cut":false,"hidden":false,"merged":[[0,3,0,4],[0,5,0,9],[1,3,1,4],[1,5,9,9],[2,3,2,4],[3,3,3,4],[4,3,4,4],[5,3,5,4],[6,3,6,4],[7,3,7,4],[9,3,9,4],[8,3,8,4],[44,5,44,7],[10,3,10,4],[12,4,12,9],[13,4,13,9],[14,4,16,9],[41,2,41,3]]}
[null,"NOM",null,null,null,"Zone en-tête / Marianne"]
[null,"PRENOM"]
[null,"N° DE SECURITE SOCIALE"]
[null,"GRADE",null,"AED"]
[null,"MINISTERE",null,206]
[null,"RNE"]
[null,"DEPARTEMENT",null,"092"]
[null,"MATRICULE"]
[null,"MODALITE DE SERVICE",null,"TEMPS COMPLET"]
[null,"QUOTITE DE SERVICE ",null,0.5]
[null,"QUOTITE FINANCIERE ",null,{"$f":"IF(D9=REFERENTIEL!B9, IF(AND(D10>79.99%, D10<90.01%), ROUND(D10*4/7+0.4, 3), D10), D10)","v":0.5},null,{"$f":"IF(D9=REFERENTIEL!B7, IF(D10<100%, \"Vérifier la quotité de service\", \" \"), \" \")","v":"Vérifier la quotité de service"}]
[null,null,null,{"$f":"IF(OR(D9=REFERENTIEL!B8, D9=REFERENTIEL!B9), IF(D10>99%, \"Vérifier la quotité de service\", \" \"), \" \")","v":" "}]
[null,"Programme :",null,null,"ETAT DE LIQUIDATION"]
[null,"Action - Sous-action :",null,null,"ELEMENT DE PAIE REP OU RER"]
[null,"Compte PCE de l'indemnité :",null,null,"Décret n° 2015-1087  du 28 août 2015 modifié portant régime indemnitaire spécifique en faveur des personnels exerçant dans les écoles ou établissements relevant des programmes « Réseau d'éducation prioritaire renforcé » \net « Réseau d'éducation prioritaire »"]
[null,"Code PCE :"]
[null,"Date de début de paiement","2023-09-01"]
[null,"Date de fin de paiement","2023-09-30","La date de fin doit toujours correspondre à une date de fin de mois"]
[]
[]
[null,"Nombre d'heures total effectué sur la période",{"$f":"C23+C24+C26","v":75.84},"Correspond au temps de travail face à face élèves"]
[null,null,null,"% d’attribution*","Montant mensuel si pas d'absence suspensive ou demi traitement","Montant à déduire si congé suspensif","Montant à verser à la fin du mois"]
[null,"HEURES EXERCICE REP+*",null,{"$f":"C23/$C$21*D11","v":0},{"$f":"REFERENTIEL!D3*D23/360*30","v":0},{"$f":"E37","v":0},{"$f":"E23-F23","v":0}]
[null,"HEURES EXERCICE REP*",75.84,{"$f":"C24/$C$21*D11","v":0.5},{"$f":"REFERENTIEL!D4*D24/360*30","v":46.083333333333336},{"$f":"F37","v":0},{"$f":"E24-F24","v":46.083333333333336}]
[null,null,null,null,{"$f":"SUM(E23:E24)","v":46.083333333333336},{"$f":"SUM(F23:F24)","v":0},{"$f":"SUM(G23:G24)","v":46.083333333333336}]
[null,"Heures exercice hors EP*",null,{"$f":"C26/$C$21*D11","v":0}]
[null,"*Ces trois champs doivent être obligatoirement renseignés"]
[null,null,null,"* ces % se calculent au regard de la quotité d'exercice en EP et de la quotité financière de l'agent"]
[]
[null,"Congés suspensifs ou demi-traitement"]
[null,"Non","Date de début","Date de fin","Montant à déduire REP+","Montant à déduire REP",null,"Nombre de jours d'absence"]
[null,null,null,null,{"$f":"IF(C32>0,IF(B32=\"congé suspensif\",H32/30*$E$23,IF(B32=\"Demi-traitement non suspensif\",H32/30*$E$23/2,\" \")),\" \")","v":" "},{"$f":"IF(C32>0,IF(B32=\"congé suspensif\",H32/30*$E$24,IF(B32=\"Demi-traitement non suspensif\",H32/30*$E$24/2,\" \")),\" \")","v":" "},{"$f":"IF($B$31=\"Non\", IF(C32>0, \"Ne pas renseigner cette rubrique si la cellule B31 = non\", \" \"), \" \")","v":" "},{"$f":"IF(C32>0,_xlfn.DAYS(D32,C32)+1,0)","v":0}]
[null,null,null,null,{"$f":"IF(C33>0,IF(B33=\"congé suspensif\",H33/30*$E$23,IF(B33=\"Demi-traitement non suspensif\",H33/30*$E$23/2,\" \")),\" \")","v":" "},{"$f":"IF(C33>0,IF(B33=\"congé suspensif\",H33/30*$E$24,IF(B33=\"Demi-traitement non suspensif\",H33/30*$E$24/2,\" \")),\" \")","v":" "},{"$f":"IF($B$31=\"Non\", IF(C33>0, \"Ne pas renseigner cette rubrique si la cellule B31 = non\", \" \"), \" \")","v":" "},{"$f":"IF(C33>0,_xlfn.DAYS(D33,C33)+1,0)","v":0}]
[null,null,null,null,{"$f":"IF(C34>0,IF(B34=\"congé suspensif\",H34/30*$E$23,IF(B34=\"Demi-traitement non suspensif\",H34/30*$E$23/2,\" \")),\" \")","v":" "},{"$f":"IF(C34>0,IF(B34=\"congé suspensif\",H34/30*$E$24,IF(B34=\"Demi-traitement non suspensif\",H34/30*$E$24/2,\" \")),\" \")","v":" "},{"$f":"IF($B$31=\"Non\", IF(C34>0, \"Ne pas renseigner cette rubrique si la cellule B31 = non\", \" \"), \" \")","v":" "},0]
[null,null,null,null,{"$f":"IF(C35>0,IF(B35=\"congé suspensif\",H35/30*$E$23,IF(B35=\"Demi-traitement non suspensif\",H35/30*$E$23/2,\" \")),\" \")","v":" "},{"$f":"IF(C35>0,IF(B35=\"congé suspensif\",H35/30*$E$24,IF(B35=\"Demi-traitement non suspensif\",H35/30*$E$24/2,\" \")),\" \")","v":" "},{"$f":"IF($B$31=\"Non\", IF(C35>0, \"Ne pas renseigner cette rubrique si la cellule B31 = non\", \" \"), \" \")","v":" "},0]
[null,null,null,null,{"$f":"IF(C36>0,IF(B36=\"congé suspensif\",H36/30*$E$23,IF(B36=\"Demi-traitement non suspensif\",H36/30*$E$23/2,\" \")),\" \")","v":" "},{"$f":"IF(C36>0,IF(B36=\"congé suspensif\",H36/30*$E$24,IF(B36=\"Demi-traitement non suspensif\",H36/30*$E$24/2,\" \")),\" \")","v":" "}," ",0]
[null,null,null,"Total",{"$f":"SUM(E32:E36)","v":0},{"$f":"SUM(F32:F36)","v":0},null,{"$f":"SUM(H32:H36)","v":0}]
[null,"Congé suspensif = Absence pendant laquelle l'agent est remplacé"]
[null,"Le nombre de lignes sera à saisir autant que de besoin en fonction du nombre de congés interruptifs sur la période"]
[]
[]
[null,"Lieu + date                                                 A",null,null,"le ",{"$f":"TODAY()","v":"2023-06-26"}]
[null,"Fonction du signataire "]
[null,"Nom du signataire"]
[null,null,null,null,null,"MENJS DAF C3 verion DAFC3 n°001 du",null,null,null,"2023-02-10"]

{"sheet":"CALCUL - mensuel","index":2,"n_rows":45,"n_cols":10,"rows_kept":45,"cut":false,"hidden":false,"merged":[[10,3,10,4],[13,4,13,9],[14,4,16,9],[41,2,41,3],[44,5,44,7],[12,4,12,9],[0,5,0,9],[9,3,9,4],[0,3,0,4],[1,3,1,4],[2,3,2,4],[3,3,3,4],[4,3,4,4],[5,3,5,4],[6,3,6,4],[7,3,7,4],[8,3,8,4],[1,5,9,9]]}
[null,"NOM",null,null,null,"Zone en-tête / Marianne"]
[null,"PRENOM"]
[null,"N° DE SECURITE SOCIALE"]
[null,"GRADE"]
[null,"MINISTERE",null,206]
[null,"RNE"]
[null,"DEPARTEMENT",null,"092"]
[null,"MATRICULE"]
[null,"MODALITE DE SERVICE",null,"TEMPS COMPLET"]
[null,"QUOTITE DE SERVICE "]
[null,"QUOTITE FINANCIERE ",null,{"$f":"IF(D9=REFERENTIEL!B9, IF(AND(D10>79.99%, D10<90.01%), ROUND(D10*4/7+0.4, 3), D10), D10)","v":0},null,{"$f":"IF(D9=REFERENTIEL!B7, IF(D10<100%, \"Vérifier la quotité de service\", \" \"), \" \")","v":"Vérifier la quotité de service"}]
[null,null,null,{"$f":"IF(OR(D9=REFERENTIEL!B8, D9=REFERENTIEL!B9), IF(D10>99%, \"Vérifier la quotité de service\", \" \"), \" \")","v":" "}]
[null,"Programme :",null,null,"ETAT DE LIQUIDATION"]
[null,"Action - Sous-action :",null,null,"ELEMENT DE PAIE REP OU RER"]
[null,"Compte PCE de l'indemnité :",null,null,"Décret n° 2015-1087  du 28 août 2015 modifié portant régime indemnitaire spécifique en faveur des personnels exerçant dans les écoles ou établissements relevant des programmes « Réseau d'éducation prioritaire renforcé » \net « Réseau d'éducation prioritaire »"]
[null,"Code PCE :"]
[null,"Date de début de paiement"]
[null,"Date de fin de paiement",null,"La date de fin doit toujours correspondre à une date de fin de mois"]
[]
[]
[null,"Nombre d'heures total effectué sur la période",{"$f":"C23+C24+C26","v":0},"Correspond au temps de travail face à face élèves"]
[null,null,null,"% d’attribution*","Montant mensuel si pas d'absence suspensive ou demi traitement","Montant à déduire si congé suspensif","Montant à verser à la fin du mois"]
[null,"HEURES EXERCICE REP+*",0,{"$f":"C23/$C$21*D11","v":{"$error":"#DIV/0!"}},{"$f":"REFERENTIEL!D3*D23/360*30","v":{"$error":"#DIV/0!"}},{"$f":"E37","v":0},{"$f":"E23-F23","v":{"$error":"#DIV/0!"}}]
[null,"HEURES EXERCICE REP*",0,{"$f":"C24/$C$21*D11","v":{"$error":"#DIV/0!"}},{"$f":"REFERENTIEL!D4*D24/360*30","v":{"$error":"#DIV/0!"}},{"$f":"F37","v":0},{"$f":"E24-F24","v":{"$error":"#DIV/0!"}}]
[null,null,null,null,{"$f":"SUM(E23:E24)","v":{"$error":"#DIV/0!"}},{"$f":"SUM(F23:F24)","v":0},{"$f":"SUM(G23:G24)","v":{"$error":"#DIV/0!"}}]
[null,"Heures exercice hors EP*",null,{"$f":"C26/$C$21*D11","v":{"$error":"#DIV/0!"}}]
[null,"*Ces trois champs doivent être obligatoirement renseignés"]
[null,null,null,"* ces % se calculent au regard de la quotité d'exercice en EP et de la quotité financière de l'agent"]
[]
[null,"Congés suspensifs ou demi-traitement"]
[null,"Non","Date de début","Date de fin","Montant à déduire REP+","Montant à déduire REP",null,"Nombre de jours d'absence"]
[null,null,null,null,{"$f":"IF(C32>0,IF(B32=\"congé suspensif\",H32/30*$E$23,IF(B32=\"Demi-traitement non suspensif\",H32/30*$E$23/2,\" \")),\" \")","v":" "},{"$f":"IF(C32>0,IF(B32=\"congé suspensif\",H32/30*$E$24,IF(B32=\"Demi-traitement non suspensif\",H32/30*$E$24/2,\" \")),\" \")","v":" "},{"$f":"IF($B$31=\"Non\", IF(C32>0, \"Ne pas renseigner cette rubrique si la cellule B31 = non\", \" \"), \" \")","v":" "},{"$f":"IF(C32>0,_xlfn.DAYS(D32,C32)+1,0)","v":0}]
[null,null,null,null,{"$f":"IF(C33>0,IF(B33=\"congé suspensif\",H33/30*$E$23,IF(B33=\"Demi-traitement non suspensif\",H33/30*$E$23/2,\" \")),\" \")","v":" "},{"$f":"IF(C33>0,IF(B33=\"congé suspensif\",H33/30*$E$24,IF(B33=\"Demi-traitement non suspensif\",H33/30*$E$24/2,\" \")),\" \")","v":" "},{"$f":"IF($B$31=\"Non\", IF(C33>0, \"Ne pas renseigner cette rubrique si la cellule B31 = non\", \" \"), \" \")","v":" "},{"$f":"IF(C33>0,_xlfn.DAYS(D33,C33)+1,0)","v":0}]
[null,null,null,null,{"$f":"IF(C34>0,IF(B34=\"congé suspensif\",H34/30*$E$23,IF(B34=\"Demi-traitement non suspensif\",H34/30*$E$23/2,\" \")),\" \")","v":" "},{"$f":"IF(C34>0,IF(B34=\"congé suspensif\",H34/30*$E$24,IF(B34=\"Demi-traitement non suspensif\",H34/30*$E$24/2,\" \")),\" \")","v":" "},{"$f":"IF($B$31=\"Non\", IF(C34>0, \"Ne pas renseigner cette rubrique si la cellule B31 = non\", \" \"), \" \")","v":" "},0]
[null,null,null,null,{"$f":"IF(C35>0,IF(B35=\"congé suspensif\",H35/30*$E$23,IF(B35=\"Demi-traitement non suspensif\",H35/30*$E$23/2,\" \")),\" \")","v":" "},{"$f":"IF(C35>0,IF(B35=\"congé suspensif\",H35/30*$E$24,IF(B35=\"Demi-traitement non suspensif\",H35/30*$E$24/2,\" \")),\" \")","v":" "},{"$f":"IF($B$31=\"Non\", IF(C35>0, \"Ne pas renseigner cette rubrique si la cellule B31 = non\", \" \"), \" \")","v":" "},0]
[null,null,null,null,{"$f":"IF(C36>0,IF(B36=\"congé suspensif\",H36/30*$E$23,IF(B36=\"Demi-traitement non suspensif\",H36/30*$E$23/2,\" \")),\" \")","v":" "},{"$f":"IF(C36>0,IF(B36=\"congé suspensif\",H36/30*$E$24,IF(B36=\"Demi-traitement non suspensif\",H36/30*$E$24/2,\" \")),\" \")","v":" "}," ",0]
[null,null,null,"Total",{"$f":"SUM(E32:E36)","v":0},{"$f":"SUM(F32:F36)","v":0},null,{"$f":"SUM(H32:H36)","v":0}]
[null,"Congé suspensif = Absence pendant laquelle l'agent est remplacé"]
[null,"Le nombre de lignes sera à saisir autant que de besoin en fonction du nombre de congés interruptifs sur la période"]
[]
[]
[null,"Lieu + date                                                 A",null,null,"le ",{"$f":"TODAY()","v":"2023-06-26"}]
[null,"Fonction du signataire "]
[null,"Nom du signataire"]
[null,null,null,null,null,"MENJS DAF C3 verion DAFC3 n°001 du",null,null,null,"2023-02-10"]

{"sheet":"Calcul infra-mensuel","index":3,"n_rows":35,"n_cols":12,"rows_kept":35,"cut":false,"hidden":true,"merged":[[0,3,0,4],[0,5,0,8],[1,3,1,4],[1,5,8,8],[2,3,2,4],[3,3,3,4],[4,3,4,4],[5,3,5,4],[6,3,6,4],[7,3,7,4],[8,3,8,4],[9,3,9,4],[10,1,10,2],[10,3,10,4],[11,1,11,2],[11,3,11,4],[13,4,13,8],[14,4,14,8],[16,4,20,8],[31,2,31,3],[34,5,34,7]]}
[null,"NOM",null,"DUPONT",null,"Zone en-tête / Marianne"]
[null,"PRENOM",null,"PIERRE"]
[null,"NIR",null,164055763801570]
[null,"GRADE",null,"PSYEN-EDA"]
[null,"MINISTERE",null,206]
[null,"CODE ADMINISTRATION",null,"L33"]
[null,"DEPARTEMENT",null,"02A"]
[null,"N° D'ORDRE",null,"00"]
[null,"QUOTITE DE SERVICE ",null,1]
[null,"QUOTITE FINANCIERE ",null,{"$f":"IF(D9=80%,REFERENTIEL!B8,IF(D9=90%,REFERENTIEL!B9,D9))","v":1}]
[null,"REGIME DE REMUNERATION",null,"Plein traitement",null,{"$f":"IF(D11=REFERENTIEL!A11,REFERENTIEL!B11,IF(D11=REFERENTIEL!A12,REFERENTIEL!B12,REFERENTIEL!B13))","v":0}]
[null,"Σ des Quotités d'occupation (temps plein ou incomplet)",null,1]
[]
[null,"Programme :","0140",null,"ETAT DE LIQUIDATION"]
[null,"Action - Sous-action :",null,null,"IR2440 REP+ et 2441 REP"]
[null,"Compte PCE de l'indemnité :",641422]
[null,"Code PCE :","JD",null,"Décret n° 2015-1087  du 28 août 2015 modifié portant régime indemnitaire spécifique en faveur des personnels exerçant dans les écoles ou établissements relevant des programmes « Réseau d'éducation prioritaire renforcé » \net « Réseau d'éducation prioritaire »",null,null,null,null,null,null,{"$f":"IF(J25=C18, \"La date de début de paiement ne doit pas être comprise dans une période de congé suspensif\", IF(K24=\"Oui\", IF(J25<C19, _xlfn.DAYS(J25, C18), _xlfn.DAYS(C19+1, C18)), _xlfn.DAYS(C19+1, C18)))","v":15}]
[null,"Date de début de paiement","2023-03-01"]
[null,"Date de fin de paiement","2023-03-15"]
[null,"Obligation réglementaire de service",{"$f":"VLOOKUP(D4,REFERENTIEL!B18:G19,6,FALSE)","v":{"$error":"#N/A"}}]
[null,"Nombre heures mensuelles ETPT = 1",{"$f":"C20/7*L17","v":{"$error":"#N/A"}}]
[null,"Nombre d'heures dues par l'agent",{"$f":"D9*C21","v":{"$error":"#N/A"}}]
[null,null,null,"% à saisir"]
[null,"HEURES EXERCICE REP+",10,{"$f":"C24/C21","v":{"$error":"#N/A"}},"Présence d'un congé suspensif sur la période (remplacement, CLM, CLD, …)",null,null,null,null,null,"Non"]
[null,"HEURES EXERCICE REP",15,{"$f":"C25/C21","v":{"$error":"#N/A"}},null,null,null,{"$f":"IF( K24=\"Oui\", \"Date de début du congé suspensif\", \" \")","v":" "},null,null,{"$f":"IF(K24=\"Non\", IF(J25>0, \"Ne pas renseigner cette rubrique s'il n'y a pas de congé suspensif sur la période\", \" \"), \" \")","v":" "}]
[null,"Heures exercice hors EP",{"$f":"C22-C25-C24","v":{"$error":"#N/A"}},{"$f":"D12*D10*C26/C21","v":{"$error":"#N/A"}},null,null,null,{"$f":"IF(K24= \"Oui\", \"Date de fin du congé suspensif\", \" \")","v":" "},null,null,{"$f":"IF(K24=\"Non\",IF(J26>0,\"Ne pas renseigner cette rubrique s'il n'y a pas de congé suspensif sur la période\",\" \"),IF(J26<C19,IF(J26>0,\"Prévoir un deuxième état liquidatif pour la période de reprise après le congé suspensif\",\" \"),\" \"))","v":" "}]
[null,"Vérification",{"$f":"IF(C26>=0,IF((C24+C25+C26)=C22,\"OK\",\"KO\"),\"KO\")","v":{"$error":"#N/A"}}]
[null,null,"DATE \nDE DEBUT","DATE \nDE FIN","Taux","Donnée A","Donnée B","Montant \nde référence","Montant mensuel pour information "]
[null,{"$f":"IF(E15=REFERENTIEL!B5,REFERENTIEL!B3,IF(E15=REFERENTIEL!B4,\"\",REFERENTIEL!B3))","v":"EV RER : REP+"},{"$f":"IF(F29>0, C18, \" \")","v":{"$error":"#N/A"}},{"$f":"IF(F29>0, IF(K24=\"Oui\", J25, C19), \" \")","v":{"$error":"#N/A"}},{"$f":"VLOOKUP(D4,REFERENTIEL!B18:G19,4,FALSE)","v":{"$error":"#N/A"}},{"$f":"IF(B29=REFERENTIEL!B3, (D24*10000),\"\")","v":{"$error":"#N/A"}},10000,{"$f":"IF(E29=\"TAUX 001\",REFERENTIEL!C3,REFERENTIEL!D3)","v":{"$error":"#N/A"}},{"$f":"IF(B29=\"\",\"\",(H29*F29/G29)/12)","v":{"$error":"#N/A"}}]
[null,{"$f":"IF(#REF!=REFERENTIEL!B5,REFERENTIEL!B4,IF(E15=REFERENTIEL!B3,\"\",REFERENTIEL!B4))","v":{"$error":"#REF!"}},{"$f":"IF(F30>0, C18, \" \")","v":{"$error":"#REF!"}},{"$f":"IF(F30>0, IF(K24=\"Oui\", J25, C19), \" \")","v":{"$error":"#REF!"}},{"$f":"VLOOKUP(D4,REFERENTIEL!B18:G19,4,FALSE)","v":{"$error":"#N/A"}},{"$f":"IF(B30=\"\",\"\",D25*10000)","v":{"$error":"#REF!"}},10000,{"$f":"IF(E30=\"TAUX 001\",REFERENTIEL!C4,REFERENTIEL!D4)","v":{"$error":"#N/A"}},{"$f":"IF(B30=\"\",\"\",(H30*F30/G30)/12)","v":{"$error":"#REF!"}}]
[]
[null,"Lieu + date                                                 A",null,null,"le ",{"$f":"TODAY()","v":"2023-06-26"}]
[null,"Fonction du signataire "]
[null,"Nom du signataire"]
[null,null,null,null,null,"MENJS DAF C3 verion DAFC3 n°001 du",null,null,"2023-02-10"]

{"sheet":"REFERENTIEL","index":4,"n_rows":110,"n_cols":9,"rows_kept":110,"cut":false,"hidden":false,"merged":[[93,2,93,3],[19,1,19,4],[20,2,20,3],[87,2,87,3],[88,2,88,3],[89,2,89,3],[90,2,90,3],[91,2,91,3],[92,2,92,3],[81,2,81,3],[82,2,82,3],[83,2,83,3],[84,2,84,3],[85,2,85,3],[86,2,86,3],[75,2,75,3],[76,2,76,3],[77,2,77,3],[78,2,78,3],[79,2,79,3],[80,2,80,3],[74,2,74,3],[63,2,63,3],[64,2,64,3],[65,2,65,3],[66,2,66,3],[67,2,67,3],[68,2,68,3],[69,2,69,3],[70,2,70,3],[71,2,71,3],[72,2,72,3],[73,2,73,3],[62,2,62,3],[51,2,51,3],[52,2,52,3],[53,2,53,3],[54,2,54,3],[55,2,55,3],[56,2,56,3],[57,2,57,3],[58,2,58,3],[59,2,59,3],[60,2,60,3],[61,2,61,3],[50,2,50,3],[39,2,39,3],[40,2,40,3],[41,2,41,3],[42,2,42,3],[43,2,43,3],[44,2,44,3],[45,2,45,3],[46,2,46,3],[47,2,47,3],[48,2,48,3],[49,2,49,3],[38,2,38,3],[27,2,27,3],[28,2,28,3],[29,2,29,3],[30,2,30,3],[31,2,31,3],[32,2,32,3],[33,2,33,3],[34,2,34,3],[35,2,35,3],[36,2,36,3],[37,2,37,3],[26,2,26,3],[21,2,21,3],[22,2,22,3],[23,2,23,3],[24,2,24,3],[25,2,25,3]]}
[]
["EDUC PRIORITAIRE","CODE","TAUX 001","TAUX 002",null,"CORPS","AESH",null,"DEPARTEMENT"]
["REP+","EV RER : REP+",5114,3263,null,null,null,null,"001"]
["REP","EV REP  : REP",1734,1106,null,null,null,null,"002"]
["HORS EP","ELEMENT DE PAIE REP OU RER",null,null,null,null,null,null,"003"]
[null,null,null,null,null,null,null,null,"004"]
[null,"TEMPS COMPLET",null,"PRISE EN CHARGE","00",null,null,null,"005"]
[null,"TEMPS INCOMPLET",null,null,"01",null,null,null,"006"]
[null,"TEMPS PARTIEL",null,null,"02",null,null,null,"007"]
[null,null,null,null,"03",null,null,null,"008"]
[null,null,null,null,"04",null,null,null,"009"]
[null,null,null,null,null,null,null,null,"010"]
[null,null,null,"PROGRAMME","0230",null,null,null,"011"]
[null,null,null,null,null,null,null,null,"012"]
["MDS PSYEN EDA AED AESH","151.57",null,null,null,null,null,null,"013"]
["PSYEN EDO",81,null,null,null,null,null,null,"014"]
[null,null,null,null,null,null,null,null,"015"]
[null,"AESH","REP+","IR 2440 REP+","TAUX 002",3264,39.1,null,"016"]
[null,"AESH","REP","IR 2441 REP","TAUX 002",1106,39.1,null,"017"]
[null,"Action - Sous Action",null,null,null,null,null,null,"018"]
[null,1,2,null,3,null,null,null,"019"]
[null,"10","Enseignement pré-élémentaire",null,"0140-01",null,null,null,"02A"]
[null,"15","Enseignement élémentaire : personnel",null,"0140-02-01",null,null,null,"02B"]
[null,"20","Besoins éducatifs particuliers : personnel",null,"0140-03-01",null,null,null,"021"]
[null,"21","Prévention et traitement des difficultés scolaires (hors CPER)",null,"0140-03-02",null,null,null,"022"]
[null,"22","Intégration des primo arrivants (hors CPER)",null,"0140-03-03",null,null,null,"023"]
[null,"23","Scolarisation des élèves malades ou handicapés (hors CPER)",null,"0140-03-04",null,null,null,"024"]
[null,"24","Enseignement à l'extérieur de l'école (hors CPER)",null,"0140-03-05",null,null,null,"025"]
[null,"25","Formation des personnels enseignants",null,"0140-04",null,null,null,"026"]
[13,"30","Remplacement",null,"0140-05",null,null,null,"027"]
[14,"35","Pilotage et encadrement pédagogique : personnel",null,"0140-06-01",null,null,null,"028"]
[null,"36","Pilotage et encadrement pédagogiques : personnels de direction",null,"0140-06-02",null,null,null,"029"]
[null,"37","Pilotage et encadrement pédagogiques : personnels d'inspection",null,"0140-06-03",null,null,null,"030"]
[1,"38","Pilotage et encadrement pédagogiques : personnels enseignants affectés à l'encadrement pédagogique",null,"0140-06-04",null,null,null,"031"]
[2,"40","Personnels en situations diverses : personnel",null,"0140-07-01",null,null,null,"032"]
[3,"41","Personnels en réadaptation ou en réemploi",null,"0140-07-02",null,null,null,"033"]
[4,"42","Personnels en décharge syndicale",null,"0140-07-03",null,null,null,"034"]
[5,"43","Partenariats divers",null,"0140-07-04",null,null,null,"035"]
[6,"75","Fonds d'innovation pédagogique (FIP)",null,"0140-07-05",null,null,null,"036"]
[7,"99","Dépenses de personnel du programme à reventiler",null,"0140-99",null,null,null,"037"]
[8,"10","Enseignement en collège",null,"0141-01",null,null,null,"038"]
[9,"15","Enseignement général et technologique en lycée",null,"0141-02",null,null,null,"039"]
[10,"20","Enseignement professionnel sous statut scolaire",null,"0141-03",null,null,null,"040"]
[11,"25","Apprentissage",null,"0141-04",null,null,null,"041"]
[12,"30","Enseignement post-baccalauréat en lycée",null,"0141-05",null,null,null,"042"]
[13,"35","Dépenses de personnel concourant à l'action \"besoins éducatifs particuliers\"",null,"0141-06-01",null,null,null,"043"]
[14,"36","Prévention et traitement des difficultés scolaires",null,"0141-06-02",null,null,null,"044"]
[15,"37","Intégration des primo arrivants",null,"0141-06-03",null,null,null,"045"]
[16,"38","Scolarisation des élèves malades ou handicapés",null,"0141-06-04",null,null,null,"046"]
[17,"39","Enseignement à l'extérieur de l'EPLE",null,"0141-06-05",null,null,null,"047"]
[18,"40","Aide à l'insertion professionnelle",null,"0141-07",null,null,null,"048"]
[19,"45","Information et orientation",null,"0141-08",null,null,null,"049"]
[20,"50","Dépenses de personnel concourant à l'action \"formation continue des adultes en VAE\"",null,"0141-09-01",null,null,null,"050"]
[21,"55","Formation des personnels enseignants et d'orientation",null,"0141-10",null,null,null,"051"]
[22,"60","Remplacement",null,"0141-11",null,null,null,"052"]
[23,"65","Dépenses de personnel concourant à l'action \"pilotage, administration et encadrement pédagogique\"",null,"0141-12-01",null,null,null,"053"]
[24,"66","Pilotage, administration et encadrement pédagogique : personnel de direction",null,"0141-12-02",null,null,null,"054"]
[25,"67","Pilotage, administration et encadrement pédagogique : personnel d'inspection",null,"0141-12-03",null,null,null,"055"]
[26,"68","Pilotage, administration et encadrement pédagogique : personnels enseignants affectés à l'encadrement pédagogique",null,"0141-12-04",null,null,null,"056"]
[27,"69","Pilotage, administration et encadrement pédagogique : personnels administratifs des EPLE",null,"0141-12-05",null,null,null,"057"]
[28,"70","Personnels concourant à l'action \"personnels en situations diverses\"",null,"0141-13-01",null,null,null,"058"]
[29,"71","Personnels en réadaptation ou en réemploi",null,"0141-13-02",null,null,null,"059"]
[30,"72","Personnels en décharges syndicales",null,"0141-13-03",null,null,null,"060"]
[31,"73","Partenariats divers",null,"0141-13-04",null,null,null,"061"]
[32,"75","Fonds d'innovation pédagogique",null,"0141-13-05",null,null,null,"062"]
[33,"99","Dépenses de personnel du programme à reventiler",null,"0141-99",null,null,null,"063"]
[34,"10","Dépenses de personnel concourant à l'action \"pilotage et mise en oeuvre des politiques éducatives\"",null,"0214-01-01",null,null,null,"064"]
[35,"11","Pilotage et mise en oeuvre des politiques éducatives de l'enseignement scolaire",null,"0214-01-02",null,null,null,"065"]
[36,"12","Pilotage et mise en oeuvre des politiques éducatives de l'enseignement supérieur",null,"0214-01-03",null,null,null,"066"]
[37,"15","Évaluation et contrôle",null,"0214-02",null,null,null,"067"]
[38,"20","Communication",null,"0214-03",null,null,null,"068"]
[39,"25","Expertise juridique",null,"0214-04",null,null,null,"069"]
[40,"30","Personnel concourant à l'action \"action internationale\"",null,"0214-05-01",null,null,null,"070"]
[41,"35","Personnel concourant à l'action \"politiques des ressources humaines\"",null,"0214-06-01",null,null,null,"071"]
[42,"37","Recrutement des personnels enseignants",null,"0214-06-03",null,null,null,"072"]
[43,"38","Recrutement des personnels non enseignants",null,"0214-06-04",null,null,null,"073"]
[44,"39","Action sociale",null,"0214-06-05",null,null,null,"074"]
[45,"40","Formation des personnels non enseignants",null,"0214-06-06",null,null,null,"075"]
[46,"45","Personnel concourant à l'action \"logistique, système d'information et immobilier\"",null,"0214-08-01",null,null,null,"076"]
[47,"50","Personnel",null,"0214-09-01",null,null,null,"077"]
{"$rows_left_out":30}